Target
Hexokinase HKDC1 [W721R]
Ligand
BDBM46772
Substrate
Meas. Tech.
Dose Response confirmation of activators of hexokinase domain containing I (HKDC1)
EC50
6580±n/a nM
Citation
 PubChem, PC Dose Response confirmation of activators of hexokinase domain containing I (HKDC1) PubChem Bioassay (2011)[AID] 
Target
Name:
Hexokinase HKDC1 [W721R]
Synonyms:
HKDC1 putative hexokinase HKDC1
Type:
Enzyme Catalytic Domain
Mol. Mass.:
102520.24
Organism:
Homo sapiens (Human)
Description:
gi_156151420
Residue:
917
  
Inhibitor
Name:
BDBM46772
Synonyms:
4-Bromo-N-[N'-(5-methyl-3-phenyl-isoxazole-4-carbonyl)-hydrazinocarbothioyl]-benzamide 4-bromo-N-[[(5-methyl-3-phenyl-1,2-oxazole-4-carbonyl)amino]carbamothioyl]benzamide 4-bromo-N-[[[(5-methyl-3-phenyl-4-isoxazolyl)-oxomethyl]hydrazo]-sulfanylidenemethyl]benzamide SMR000219129 | cid_1884906
Type:
Small organic molecule
Emp. Form.:
C19H15BrN4O3S
Mol. Mass.:
459.316
SMILES:
Cc1onc(c1C(=O)NNC(=S)NC(=O)c1ccc(Br)cc1)-c1ccccc1
: