Target
Peroxisome proliferator-activated receptor alpha
Ligand
BDBM61571
Substrate
Meas. Tech.
Late stage assay provider counterscreen for partial agonists of the peroxisome proliferator-activated receptor gamma (PPARg)
EC50
>3000±n/a nM
Citation
 PubChem, PC Late stage assay provider counterscreen for partial agonists of the peroxisome proliferator-activated receptor gamma (PPARg): Luminescence-based cell-based dose response assay for partial agonists of the peroxisome proliferator-activated receptor alpha (PPARA). PubChem Bioassay (2011)[AID] 
Target
Name:
Peroxisome proliferator-activated receptor alpha
Synonyms:
NR1C1 PPAR PPAR-alpha PPARA_HUMAN Peroxisome proliferator-activated receptor | Peroxisome proliferator-activated receptor alpha (PPAR alpha)
Type:
Enzyme
Mol. Mass.:
52222.08
Organism:
Homo sapiens (Human)
Description:
Q07869
Residue:
468
  
Inhibitor
Name:
BDBM61571
Synonyms:
3-(5-{[3-(4-methoxy-2-methylphenyl)-1-phenyl-1H-pyrazol-4-yl]methylene}-4-oxo-2-thioxo-1,3-thiazolidin-3-yl)propanoic acid 3-[(5E)-5-[[3-(4-methoxy-2-methyl-phenyl)-1-phenyl-pyrazol-4-yl]methylidene]-4-oxidanylidene-2-sulfanylidene-1,3-thiazolidin-3-yl]propanoic acid 3-[(5E)-5-[[3-(4-methoxy-2-methylphenyl)-1-phenylpyrazol-4-yl]methylidene]-4-oxo-2-sulfanylidene-1,3-thiazolidin-3-yl]propanoic acid SMR000497337 | cid_1328217
Type:
Small organic molecule
Emp. Form.:
C24H21N3O4S2
Mol. Mass.:
479.571
SMILES:
COc1ccc(-c2nn(cc2\C=C2\SC(=S)N(CCC(O)=O)C2=O)-c2ccccc2)c(C)c1
: