Target
Tropomyosin alpha-1 chain
Ligand
BDBM50331546
Substrate
Meas. Tech.
Fluorescence-based biochemical high throughput dose response assay for inhibitors of the calcium sensitivity of cardiac Regulated Thin Filaments (RTF)
IC50
558.14±n/a nM
Citation
 PubChem, PC Fluorescence-based biochemical high throughput dose response assay for inhibitors of the calcium sensitivity of cardiac Regulated Thin Filaments (RTF) PubChem Bioassay (2011)[AID] 
Target
Name:
Tropomyosin alpha-1 chain
Synonyms:
TPM1 cardiac alpha tropomyosin
Type:
Enzyme Catalytic Domain
Mol. Mass.:
32681.01
Organism:
Sus scrofa
Description:
P42639
Residue:
284
  
Inhibitor
Name:
BDBM50331546
Synonyms:
2-(4,5,6-trihydroxy-3-oxo-3H-xanthen-9-yl)benzenesulfonic acid cid_360404 | pyrogallol red
Type:
Small organic molecule
Emp. Form.:
C19H12O8S
Mol. Mass.:
400.359
SMILES:
Oc1ccc2c(-c3ccccc3S(O)(=O)=O)c3ccc(=O)c(O)c3oc2c1O
: