Target
Hexokinase-1
Ligand
BDBM80806
Substrate
Meas. Tech.
Dose Response confirmation of activators of hexokinase domain containing I (HKDC1) in the hexokinase 1 selectivity assay
EC50
17900±n/a nM
Citation
 PubChem, PC Dose Response confirmation of activators of hexokinase domain containing I (HKDC1) in the hexokinase 1 selectivity assay PubChem Bioassay (2011)[AID] 
Target
Name:
Hexokinase-1
Synonyms:
Brain form hexokinase HK1 Hexokinase type I hexokinase-1 isoform HKI
Type:
PROTEIN
Mol. Mass.:
102488.34
Organism:
Homo sapiens (Human)
Description:
EBI_11382
Residue:
917
  
Inhibitor
Name:
BDBM80806
Synonyms:
3-(1,3-diketobenzo[de]isoquinolin-2-yl)propyl-[6-[3-(1,3-diketobenzo[de]isoquinolin-2-yl)propyl-dimethyl-ammonio]hexyl]-dimethyl-ammonium;bromide 3-(1,3-dioxobenzo[de]isoquinolin-2-yl)propyl-[6-[3-(1,3-dioxobenzo[de]isoquinolin-2-yl)propyl-dimethylazaniumyl]hexyl]-dimethylazanium;bromide MLS002172486 WB64 | cid_405251
Type:
Small organic molecule
Emp. Form.:
C40H48N4O4
Mol. Mass.:
648.8324
SMILES:
C[N+](C)(CCCCCC[N+](C)(C)CCCN1C(=O)c2cccc3cccc(C1=O)c23)CCCN1C(=O)c2cccc3cccc(C1=O)c23
: