Target
Hexokinase-1
Ligand
BDBM80819
Substrate
Meas. Tech.
Dose Response confirmation of activators of hexokinase domain containing I (HKDC1) in the hexokinase 1 selectivity assay
EC50
>80000±n/a nM
Citation
 PubChem, PC Dose Response confirmation of activators of hexokinase domain containing I (HKDC1) in the hexokinase 1 selectivity assay PubChem Bioassay (2011)[AID] 
Target
Name:
Hexokinase-1
Synonyms:
Brain form hexokinase HK1 Hexokinase type I hexokinase-1 isoform HKI
Type:
PROTEIN
Mol. Mass.:
102488.34
Organism:
Homo sapiens (Human)
Description:
EBI_11382
Residue:
917
  
Inhibitor
Name:
BDBM80819
Synonyms:
1-(3-methylphenyl)-3-(1-pyridin-2-ylethylideneamino)thiourea 1-(m-tolyl)-3-[1-(2-pyridyl)ethylideneamino]thiourea SMR001565772 | cid_3005040
Type:
Small organic molecule
Emp. Form.:
C15H16N4S
Mol. Mass.:
284.379
SMILES:
CC(=NNC(=S)Nc1cccc(C)c1)c1ccccn1
: