Target
Glucose-6-phosphate dehydrogenase-6-phosphogluconolactonase
Ligand
BDBM33066
Substrate
Meas. Tech.
Dose Response confirmation of uHTS small molecule inhibitors of Plasmodium falciparum Glucose-6-phosphate dehydrogenase via a fluorescence intensity assay
IC50
3320±n/a nM
Citation
 PubChem, PC Dose Response confirmation of uHTS small molecule inhibitors of Plasmodium falciparum Glucose-6-phosphate dehydrogenase via a fluorescence intensity assay PubChem Bioassay (2011)[AID] 
Target
Name:
Glucose-6-phosphate dehydrogenase-6-phosphogluconolactonase
Synonyms:
Type:
Enzyme Catalytic Domain
Mol. Mass.:
109731.64
Organism:
Plasmodium falciparum 3D7
Description:
gi_12381848
Residue:
950
  
Inhibitor
Name:
BDBM33066
Synonyms:
2,5-bis(chloranyl)-3-[2-(dimethylamino)-1,3-thiazol-5-yl]-6-pyrrolidin-1-yl-cyclohexa-2,5-diene-1,4-dione 2,5-dichloro-3-[2-(dimethylamino)-1,3-thiazol-5-yl]-6-pyrrolidin-1-ylcyclohexa-2,5-diene-1,4-dione 2,5-dichloro-3-[2-(dimethylamino)thiazol-5-yl]-6-pyrrolidino-p-benzoquinone SMR000115102 | cid_1002248
Type:
Small organic molecule
Emp. Form.:
C15H15Cl2N3O2S
Mol. Mass.:
372.27
SMILES:
CN(C)c1ncc(s1)C1=C(Cl)C(=O)C(N2CCCC2)=C(Cl)C1=O
: