Target
Glucose-6-phosphate dehydrogenase-6-phosphogluconolactonase
Ligand
BDBM81051
Substrate
Meas. Tech.
Dose Response confirmation of uHTS small molecule inhibitors of Plasmodium falciparum Glucose-6-phosphate dehydrogenase via a fluorescence intensity assay
IC50
3380±n/a nM
Citation
 PubChem, PC Dose Response confirmation of uHTS small molecule inhibitors of Plasmodium falciparum Glucose-6-phosphate dehydrogenase via a fluorescence intensity assay PubChem Bioassay (2011)[AID] 
Target
Name:
Glucose-6-phosphate dehydrogenase-6-phosphogluconolactonase
Synonyms:
Type:
Enzyme Catalytic Domain
Mol. Mass.:
109731.64
Organism:
Plasmodium falciparum 3D7
Description:
gi_12381848
Residue:
950
  
Inhibitor
Name:
BDBM81051
Synonyms:
2-[6-bromanyl-2-(2-bromophenyl)-4-phenyl-4H-quinazolin-3-yl]ethanehydrazide MLS000588337 [6-Bromo-2-(2-bromo-phenyl)-4-phenyl-4H-quinazolin-3-yl]-acetic acid hydrazide | cid_4358566
Type:
Small organic molecule
Emp. Form.:
C22H18Br2N4O
Mol. Mass.:
514.213
SMILES:
NNC(=O)CN1C(c2ccccc2)c2cc(Br)ccc2N=C1c1ccccc1Br
: