Target
Glucose-6-phosphate dehydrogenase-6-phosphogluconolactonase
Ligand
BDBM81109
Substrate
Meas. Tech.
Dose Response confirmation of uHTS small molecule inhibitors of Plasmodium falciparum Glucose-6-phosphate dehydrogenase via a fluorescence intensity assay
IC50
1650±n/a nM
Citation
 PubChem, PC Dose Response confirmation of uHTS small molecule inhibitors of Plasmodium falciparum Glucose-6-phosphate dehydrogenase via a fluorescence intensity assay PubChem Bioassay (2011)[AID] 
Target
Name:
Glucose-6-phosphate dehydrogenase-6-phosphogluconolactonase
Synonyms:
Type:
Enzyme Catalytic Domain
Mol. Mass.:
109731.64
Organism:
Plasmodium falciparum 3D7
Description:
gi_12381848
Residue:
950
  
Inhibitor
Name:
BDBM81109
Synonyms:
8-(2-cyclohexylidenehydrazinyl)-7-[2-(4-methoxyphenyl)ethyl]-3-methyl-purine-2,6-dione 8-(N'-Cyclohexylidene-hydrazino)-7-[2-(4-methoxy-phenyl)-ethyl]-3-methyl-3,7-dihydro-purine-2,6-dione MLS000762903 cid_3266651
Type:
Small organic molecule
Emp. Form.:
C21H26N6O3
Mol. Mass.:
410.4695
SMILES:
COc1ccc(CCn2c(NN=C3CCCCC3)nc3n(C)c(=O)[nH]c(=O)c23)cc1
: