Target
Glucose-6-phosphate 1-dehydrogenase
Ligand
BDBM48771
Substrate
Meas. Tech.
Human Glucose-6-Phosphate Dehydrogenase Dose Response Selectivity Assay for Inhibitors of Plasmodium falciparum Glucose-6-Phosphate Dehydrogenase
IC50
26900±n/a nM
Citation
 PubChem, PC Human Glucose-6-Phosphate Dehydrogenase Dose Response Selectivity Assay for Inhibitors of Plasmodium falciparum Glucose-6-Phosphate Dehydrogenase PubChem Bioassay (2011)[AID] 
Target
Name:
Glucose-6-phosphate 1-dehydrogenase
Synonyms:
G6PD Glucose 6-phosphate dehydrogenase (G6PD) glucose-6-phosphate 1-dehydrogenase isoform b
Type:
Enzyme
Mol. Mass.:
59258.58
Organism:
Homo sapiens (Human)
Description:
P11413
Residue:
515
  
Inhibitor
Name:
BDBM48771
Synonyms:
(Z)-2-butenedioic acid;2-[[2-(methylaminomethyl)phenyl]thio]benzene-1,4-diol 2-({2-[(methylamino)methyl]phenyl}sulfanyl)-1,4-benzenediol SMR000230499 maleic acid;2-[[2-(methylaminomethyl)phenyl]thio]hydroquinone
Type:
Small organic molecule
Emp. Form.:
C14H15NO2S
Mol. Mass.:
261.339
SMILES:
CNCc1ccccc1Sc1cc(O)ccc1O
: