Target
Glucose-6-phosphate 1-dehydrogenase
Ligand
BDBM81092
Substrate
Meas. Tech.
Human Glucose-6-Phosphate Dehydrogenase Dose Response Selectivity Assay for Inhibitors of Plasmodium falciparum Glucose-6-Phosphate Dehydrogenase
IC50
>80000±n/a nM
Citation
 PubChem, PC Human Glucose-6-Phosphate Dehydrogenase Dose Response Selectivity Assay for Inhibitors of Plasmodium falciparum Glucose-6-Phosphate Dehydrogenase PubChem Bioassay (2011)[AID] 
Target
Name:
Glucose-6-phosphate 1-dehydrogenase
Synonyms:
G6PD Glucose 6-phosphate dehydrogenase (G6PD) glucose-6-phosphate 1-dehydrogenase isoform b
Type:
Enzyme
Mol. Mass.:
59258.58
Organism:
Homo sapiens (Human)
Description:
P11413
Residue:
515
  
Inhibitor
Name:
BDBM81092
Synonyms:
7-ethyl-3-methyl-8-nitro-purine-2,6-dione 7-ethyl-3-methyl-8-nitropurine-2,6-dione SMR000282695 | cid_1548086
Type:
Small organic molecule
Emp. Form.:
C8H9N5O4
Mol. Mass.:
239.1882
SMILES:
CCn1c(nc2n(C)c(=O)[nH]c(=O)c12)[N+]([O-])=O
: