Target
Glucose-6-phosphate 1-dehydrogenase
Ligand
BDBM81096
Substrate
Meas. Tech.
Human Glucose-6-Phosphate Dehydrogenase Dose Response Selectivity Assay for Inhibitors of Plasmodium falciparum Glucose-6-Phosphate Dehydrogenase
IC50
46700±n/a nM
Citation
 PubChem, PC Human Glucose-6-Phosphate Dehydrogenase Dose Response Selectivity Assay for Inhibitors of Plasmodium falciparum Glucose-6-Phosphate Dehydrogenase PubChem Bioassay (2011)[AID] 
Target
Name:
Glucose-6-phosphate 1-dehydrogenase
Synonyms:
G6PD Glucose 6-phosphate dehydrogenase (G6PD) glucose-6-phosphate 1-dehydrogenase isoform b
Type:
Enzyme
Mol. Mass.:
59258.58
Organism:
Homo sapiens (Human)
Description:
P11413
Residue:
515
  
Inhibitor
Name:
BDBM81096
Synonyms:
(4-methyl-3-oxidanylidene-1-phenyl-pyrazolidin-4-yl)methyl ethanoate (4-methyl-3-oxo-1-phenyltetrahydro-1H-pyrazol-4-yl)methyl acetate SMR000337422 acetic acid (4-methyl-3-oxo-1-phenyl-4-pyrazolidinyl)methyl ester | cid_3338947
Type:
Small organic molecule
Emp. Form.:
C13H16N2O3
Mol. Mass.:
248.2777
SMILES:
CC(=O)OCC1(C)CN(NC1=O)c1ccccc1
: