Target
5-hydroxytryptamine receptor 7
Ligand
BDBM50001922
Substrate
Ki
90±n/a nM
Comments
PDSP_1290
Citation
 Greenberg, DAPrichard, DCSnyder, SH Alpha-noradrenergic receptor binding in mammalian brain: differential labeling of agonist and antagonist states. Life Sci 19:69-76 (1976)  
Target
Name:
5-hydroxytryptamine receptor 7
Synonyms:
5-HT-7 5-HT7 5-HT7S 5-hydroxytryptamine receptor 7 5HT7R_RAT GPRFO Serotonin (5-HT) receptor | Serotonin Receptor 7
Type:
G Protein-Coupled Receptor (GPCR)
Mol. Mass.:
49852.62
Organism:
Rattus norvegicus (rat)
Description:
Rat cloned 5-HT7R.
Residue:
448
  
Inhibitor
Name:
BDBM50001922
Synonyms:
2-Naphthalen-1-ylmethyl-4,5-dihydro-1H-imidazole; hydrochloride CHEMBL1706 Nafazair Naphazoline Nitrate Opcon cid_11079
Type:
Small organic molecule
Emp. Form.:
C14H14N2
Mol. Mass.:
210.2744
SMILES:
C(C1=NCCN1)c1cccc2ccccc12
: