Target
Beta-2 adrenergic receptor
Ligand
BDBM25749
Substrate
Ki
>10000±n/a nM
Comments
PDSP_1525
Citation
 Bylund, DBSnyder, SH Beta adrenergic receptor binding in membrane preparations from mammalian brain. Mol Pharmacol 12:568-80 (1976) Target
Name:
Beta-2 adrenergic receptor
Synonyms:
ADRB2 ADRB2_HUMAN Beta-2 adrenoceptor | Beta-2 adrenoreceptor
Type:
Mol. Mass.:
46461.69
Organism:
Homo sapiens (Human)
Description:
P07550
Residue:
413
  
Inhibitor
Name:
BDBM25749
Synonyms:
CHEMBL6995 Practolol Practolol,(-)
Type:
Small organic molecule
Emp. Form.:
C14H22N2O3
Mol. Mass.:
266.3361
SMILES:
CC(C)NCC(O)COc1ccc(NC(C)=O)cc1
: