Target
Alpha-1A adrenergic receptor
Ligand
BDBM50017674
Substrate
Ki
3500±n/a nM
Comments
PDSP_20571
Citation
 U'Prichard, DCGreenberg, DASnyder, SH Binding characteristics of a radiolabeled agonist and antagonist at central nervous system alpha noradrenergic receptors. Mol Pharmacol 13:454-73 (1977) Target
Name:
Alpha-1A adrenergic receptor
Synonyms:
ADA1A_RAT Adra1c Alpha-1A adrenoceptor Alpha-1C adrenergic receptor | adrenergic Alpha1A
Type:
Protein
Mol. Mass.:
51620.15
Organism:
Rattus norvegicus (Rat)
Description:
P43140
Residue:
466
  
Inhibitor
Name:
BDBM50017674
Synonyms:
(2-Benzhydryloxy-ethyl)-dimethyl-amine 2-(diphenylmethoxy)-N,N-dimethylethanamine Beldin Benadryl CHEMBL657 DIPHENHYDRAMINE Diphen N-[2-(BENZHYDRYLOXY)ETHYL]-N,N-DIMETHYLAMINE US9138431, DIPHENHYDRAMINE (Benadryl) | US9333199, DIPHENHYDRAMINE (Benadryl)
Type:
Small organic molecule
Emp. Form.:
C17H21NO
Mol. Mass.:
255.3547
SMILES:
CN(C)CCOC(c1ccccc1)c1ccccc1
: