Target
Alpha-1A adrenergic receptor
Ligand
BDBM81463
Substrate
Ki
29000±n/a nM
Comments
PDSP_20536
Citation
 U'Prichard, DCGreenberg, DASnyder, SH Binding characteristics of a radiolabeled agonist and antagonist at central nervous system alpha noradrenergic receptors. Mol Pharmacol 13:454-73 (1977) Target
Name:
Alpha-1A adrenergic receptor
Synonyms:
ADA1A_RAT Adra1c Alpha-1A adrenoceptor Alpha-1C adrenergic receptor | adrenergic Alpha1A
Type:
Protein
Mol. Mass.:
51620.15
Organism:
Rattus norvegicus (Rat)
Description:
P43140
Residue:
466
  
Inhibitor
Name:
BDBM81463
Synonyms:
CAS_4201 NSC_4201
Type:
Small organic molecule
Emp. Form.:
C9H15N5O
Mol. Mass.:
209.2483
SMILES:
Nc1cc(nc(=N)n1O)N1CCCCC1
: