Target
Muscarinic acetylcholine receptor M5
Ligand
BDBM50131440
Substrate
Ki
60±n/a nM
Comments
PDSP_1205
Citation
 Bolden, CCusack, BRichelson, E Antagonism by antimuscarinic and neuroleptic compounds at the five cloned human muscarinic cholinergic receptors expressed in Chinese hamster ovary cells. J Pharmacol Exp Ther 260:576-80 (1992) Target
Name:
Muscarinic acetylcholine receptor M5
Synonyms:
ACM5_HUMAN | CHRM5
Type:
PROTEIN
Mol. Mass.:
60102.35
Organism:
Homo sapiens (Human)
Description:
ChEMBL_1517990
Residue:
532
  
Inhibitor
Name:
BDBM50131440
Synonyms:
10-(2-(1-methylpiperidin-2-yl)ethyl)-2-(methylsulfinyl)-10H-phenothiazine CHEMBL1088 NC-123 TPS-23
Type:
Small organic molecule
Emp. Form.:
C21H26N2OS2
Mol. Mass.:
386.574
SMILES:
CN1CCCCC1CCN1c2ccccc2Sc2ccc(cc12)S(C)=O
: