Target
Adenylate cyclase type 2
Ligand
BDBM81778
Substrate
Ki
2.2±n/a nM
Comments
PDSP_3932
Citation
 Andersen, PHGrønvald, FCHohlweg, RHansen, LBGuddal, EBraestrup, CNielsen, EB NNC-112, NNC-687 and NNC-756, new selective and highly potent dopamine D1 receptor antagonists. Eur J Pharmacol 219:45-52 (1992)  
Target
Name:
Adenylate cyclase type 2
Synonyms:
ADCY2_RAT Adcy2 Adenylate cyclase type 2 Adenylyl cyclase 2
Type:
PROTEIN
Mol. Mass.:
123344.82
Organism:
Rattus norvegicus
Description:
ChEMBL_305824
Residue:
1090
  
Inhibitor
Name:
BDBM81778
Synonyms:
CAS_132421 NSC_132421
Type:
Small organic molecule
Emp. Form.:
C19H20ClNO2
Mol. Mass.:
329.821
SMILES:
CN1CCc2cc(Cl)c(O)cc2C(C1)c1cccc2CCOc12
: