Target
Alpha-2C adrenergic receptor
Ligand
BDBM30712
Substrate
Ki
31±n/a nM
Comments
PDSP_1428
Citation
 Blaxall, HSMurphy, TJBaker, JCRay, CBylund, DB Characterization of the alpha-2C adrenergic receptor subtype in the opossum kidney and in the OK cell line. J Pharmacol Exp Ther 259:323-9 (1991) Target
Name:
Alpha-2C adrenergic receptor
Synonyms:
ADRA2C | adrenergic Alpha2C
Type:
Enzyme Catalytic Domain
Mol. Mass.:
27257.01
Organism:
OK
Description:
adrenergic Alpha2C ADRA2C OK::G3GWB4
Residue:
230
  
Inhibitor
Name:
BDBM30712
Synonyms:
6-tert-butyl-3-(2-imidazolin-2-ylmethyl)-2,4-dimethyl-phenol;hydrochloride 6-tert-butyl-3-(4,5-dihydro-1H-imidazol-2-ylmethyl)-2,4-dimethylphenol;hydrochloride Oxymetazoline cid_66259
Type:
Small organic molecule
Emp. Form.:
C16H24N2O
Mol. Mass.:
260.3746
SMILES:
Cc1cc(c(O)c(C)c1CC1=NCCN1)C(C)(C)C
: