Target
5-hydroxytryptamine receptor 1B
Ligand
BDBM50241143
Substrate
Ki
>10000±n/a nM
Comments
PDSP_1179
Citation
 Matsumoto, ICombs, MRJones, DJ Characterization of 5-hydroxytryptamine1B receptors in rat spinal cord via [125I]iodocyanopindolol binding and inhibition of [3H]-5-hydroxytryptamine release. J Pharmacol Exp Ther 260:614-26 (1992) Target
Name:
5-hydroxytryptamine receptor 1B
Synonyms:
5-HT-1B 5-hydroxytryptamine receptor 1B (5HT1B) 5ht1b Serotonin 1 (5-HT1) receptor Serotonin receptor 1B
Type:
Protein
Mol. Mass.:
43173.33
Organism:
Rattus norvegicus (Rat)
Description:
P28564
Residue:
386
  
Inhibitor
Name:
BDBM50241143
Synonyms:
(MDL 72222)3,5-Dichloro-benzoic acid 8-methyl-8-aza-bicyclo[3.2.1]oct-3-yl ester 3,5-Dichloro-benzoic acid 8-methyl-8-aza-bicyclo[3.2.1]oct-3-yl ester (MDL 72222) 3,5-Dichloro-benzoic acid 8-methyl-8-aza-bicyclo[3.2.1]oct-3-yl ester(MDL-72222) 3alpha-(3',5'-dichlorobenzoyloxy)tropane MDL 72222 [2-(5-Hydroxy-1H-indol-3-yl)-ethyl]-trimethyl-ammonium
Type:
Small organic molecule
Emp. Form.:
C15H17Cl2NO2
Mol. Mass.:
314.207
SMILES:
CN1C2CCC1CC(C2)OC(=O)c1cc(Cl)cc(Cl)c1
: