Target
Leucyl-cystinyl aminopeptidase
Ligand
BDBM271288
Substrate
Meas. Tech.
Inhibition of IRAP Assay
IC50
1.000±n/a nM
Citation
 Kawaguchi, KIshihata, AInagaki, YTsuchiya, KHanadate, TKanai, AKaizawa, HKazami, JMorikawa, HHiramoto, MEnjo, KTakamatsu, H Pyridine derivative US Patent  US10059720 Publication Date 8/28/2018 
Target
Name:
Leucyl-cystinyl aminopeptidase
Synonyms:
Cystinyl aminopeptidase Insulin-regulated membrane aminopeptidase Irap Leucyl-cystinyl aminopeptidase Otase P-LAP Vesicle protein of 165 kDa | Vp165
Type:
PROTEIN
Mol. Mass.:
117179.39
Organism:
Rattus norvegicus
Description:
ChEMBL_98523
Residue:
1025
  
Inhibitor
Name:
BDBM271288
Synonyms:
US10059720, Example 103 | US10975091, Example 103
Type:
Small organic molecule
Emp. Form.:
C18H28N2O4S
Mol. Mass.:
368.491
SMILES:
CSC[C@H](N)[C@](O)(Cc1cc(O[C@H]2CC[C@H](C)CC2)ccn1)C(O)=O
: