Target
D(2) dopamine receptor
Ligand
BDBM50115644
Substrate
Ki
3981.07±n/a nM
Comments
PDSP_3345
Citation
 de Boer, THMaura, GRaiteri, Mde Vos, CJWieringa, JPinder, RM Neurochemical and autonomic pharmacological profiles of the 6-aza-analogue of mianserin, Org 3770 and its enantiomers. Neuropharmacology 27:399-408 (1988)  
Target
Name:
D(2) dopamine receptor
Synonyms:
DOPAMINE D2 DOPAMINE D2 Short Dopamine D2 receptor Drd2
Type:
G Protein-Coupled Receptor (GPCR)
Mol. Mass.:
50931.60
Organism:
Rattus norvegicus (rat)
Description:
P61169
Residue:
444
  
Inhibitor
Name:
BDBM50115644
Synonyms:
(+/-)-12-Methyl-1,2,3,4,9,13b-hexahydro-2,4a,5-triaza-tribenzo[a,c,e]cycloheptene CHEMBL654 ORG 3770 | REMERON
Type:
Small organic molecule
Emp. Form.:
C17H19N3
Mol. Mass.:
265.3529
SMILES:
CN1CCN2C(C1)c1ccccc1Cc1cccnc21
: