Target
Muscarinic acetylcholine receptor M2
Ligand
BDBM50017666
Substrate
Ki
>10000±n/a nM
Comments
PDSP_1060
Citation
 Yamamura, HISnyder, SH Muscarinic cholinergic binding in rat brain. Proc Natl Acad Sci U S A 71:1725-9 (1974)  
Target
Name:
Muscarinic acetylcholine receptor M2
Synonyms:
ACM2_RAT Chrm-2 | Chrm2
Type:
Enzyme Catalytic Domain
Mol. Mass.:
51555.53
Organism:
RAT
Description:
P10980
Residue:
466
  
Inhibitor
Name:
BDBM50017666
Synonyms:
1-(p-bromophenyl)-1-(2-pyridyl)-3-dimethylaminopropane 3-(4-bromophenyl)-N,N-dimethyl-3-(2-pyridinyl)-1-propanamine 3-(p-bromophenyl)-3-(2-pyridyl)-N,N-dimethylpropylamine CHEMBL811
Type:
Small organic molecule
Emp. Form.:
C16H19BrN2
Mol. Mass.:
319.239
SMILES:
CN(C)CCC(c1ccc(Br)cc1)c1ccccn1
: