Target
Platelet-derived growth factor receptor beta
Ligand
BDBM3072
Substrate
Poly(E:Y)
Meas. Tech.
Kinase Inhibition Assay
IC50
800±n/a nM
Citation
 Klutchko, SRHamby, JMBoschelli, DHWu, ZKraker, AJAmar, AMHartl, BGShen, CKlohs, WDSteinkampf, RWDriscoll, DLNelson, JMElliott, WLRoberts, BJStoner, CLVincent, PWDykes, DJPanek, RLLu, GHMajor, TCDahring, TKHallak, HBradford, LAShowalter, HDDoherty, AM 2-Substituted aminopyrido[2,3-d]pyrimidin-7(8H)-ones. structure-activity relationships against selected tyrosine kinases and in vitro and in vivo anticancer activity. J Med Chem 41:3276-92 (1998)  
Target
Name:
Platelet-derived growth factor receptor beta
Synonyms:
Beta-type platelet-derived growth factor receptor CD140b antigen PDGF Receptor Substrate PDGFR PDGFR-1 PDGFRB PGFRB_HUMAN Platelet-derived growth factor receptor 1 Platelet-derived growth factor receptor beta (PDGFR-beta) Platelet-derived growth factor receptor beta (PDGFRbeta) | VHL/PDGFRB
Type:
Enzyme
Mol. Mass.:
123922.25
Organism:
Homo sapiens (Human)
Description:
P09619
Residue:
1106
  
Inhibitor
Name:
BDBM3072
Synonyms:
2-aminopyrido[2,3-d]pyrimidin-7(8H)-one 39 PD 166285 analog
Type:
Small organic molecule
Emp. Form.:
C21H16Cl2N4O
Mol. Mass.:
411.284
SMILES:
CCn1c2nc(Nc3ccccc3)ncc2cc(-c2c(Cl)cccc2Cl)c1=O
:
Substrate
Name:
Poly(E:Y)
Synonyms:
Type:
Random polymer
Mol. Mass.:
358.43
Organism:
Description:
Random copolymer of glutamic acid and tyrosine (4:1). 50 uM ATP containing 0.4 uCi of [gamma-32P]ATP as co-substrate
Residue:
3
NA