Target
Glutamate receptor ionotropic, NMDA 1
Ligand
BDBM50062599
Substrate
Ki
1320±n/a nM
Comments
PDSP_3005
Citation
 Bresink, IDanysz, WParsons, CGMutschler, E Different binding affinities of NMDA receptor channel blockers in various brain regions--indication of NMDA receptor heterogeneity. Neuropharmacology 34:533-40 (1995)  
Target
Name:
Glutamate receptor ionotropic, NMDA 1
Synonyms:
Glutamate (NMDA) receptor subunit zeta 1 Glutamate-NMDA-Channel Glutamate-NMDA-Polyamine NMDA Nmdar1 | phencyclidine
Type:
Enzyme Catalytic Domain
Mol. Mass.:
105533.40
Organism:
RAT
Description:
P35439
Residue:
938
  
Inhibitor
Name:
BDBM50062599
Synonyms:
3,5-Dimethyl-adamantan-1-ylamine EN300-123026 Namenda | US10214478, Compound memantine
Type:
Small organic molecule
Emp. Form.:
C12H21N
Mol. Mass.:
179.3018
SMILES:
CC12CC3CC(C)(C1)CC(N)(C3)C2
: