Target
Neuropeptides B/W receptor type 1
Ligand
BDBM81935
Substrate
Ki
1335±n/a nM
Comments
PDSP_1351
Citation
 O'Dowd, BFScheideler, MANguyen, TCheng, RRasmussen, JSMarchese, AZastawny, RHeng, HHTsui, LCShi, X The cloning and chromosomal mapping of two novel human opioid-somatostatin-like receptor genes, GPR7 and GPR8, expressed in discrete areas of the brain. Genomics 28:84-91 (1995)  
Target
Name:
Neuropeptides B/W receptor type 1
Synonyms:
GPR7 NPBWR1 | neuropeptides B/W receptor 1
Type:
Enzyme Catalytic Domain
Mol. Mass.:
36111.82
Organism:
Homo sapiens (Human)
Description:
gi_119607128
Residue:
328
  
Inhibitor
Name:
BDBM81935
Synonyms:
CAS_105618-26-6 Nor-BNI
Type:
Small organic molecule
Emp. Form.:
C40H43N3O6
Mol. Mass.:
661.7859
SMILES:
Oc1ccc2CC(C3CC3)N3CCC45C(Oc1c24)c1[nH]c2C4Oc6c7c(CC(C8CC8)N8CCC47C(O)(C8)Cc2c1CC5(O)C3)ccc6O
: