Target
Muscarinic acetylcholine receptor M4
Ligand
BDBM82370
Substrate
Ki
72.44±n/a nM
Comments
PDSP_3902
Citation
 Lazareno, SBuckley, NJRoberts, FF Characterization of muscarinic M4 binding sites in rabbit lung, chicken heart, and NG108-15 cells. Mol Pharmacol 38:805-15 (1990) Target
Name:
Muscarinic acetylcholine receptor M4
Synonyms:
ACM4_CHICK Cholinergic, muscarinic M4
Type:
Enzyme Catalytic Domain
Mol. Mass.:
54968.10
Organism:
Chick
Description:
Cholinergic, muscarinic M4 CHRM4 Chick::P17200
Residue:
490
  
Inhibitor
Name:
BDBM82370
Synonyms:
CAS_87-00-3 NSC_5821
Type:
Small organic molecule
Emp. Form.:
C16H21NO3
Mol. Mass.:
275.3428
SMILES:
CN1C2CCC1CC(C2)OC(=O)C(O)c1ccccc1
: