Target
D(2) dopamine receptor
Ligand
BDBM81778
Substrate
Ki
942±n/a nM
Comments
PDSP_3932
Citation
 Karlsson, PFarde, LHalldin, CSwahn, CGSedvall, GFoged, CHansen, KTSkrumsager, B PET examination of [11C]NNC 687 and [11C]NNC 756 as new radioligands for the D1-dopamine receptor. Psychopharmacology (Berl) 113:149-56 (1993)  
Target
Name:
D(2) dopamine receptor
Synonyms:
DOPAMINE D2 DOPAMINE D2 Short Dopamine D2 receptor Drd2
Type:
G Protein-Coupled Receptor (GPCR)
Mol. Mass.:
50931.60
Organism:
Rattus norvegicus (rat)
Description:
P61169
Residue:
444
  
Inhibitor
Name:
BDBM81778
Synonyms:
CAS_132421 NSC_132421
Type:
Small organic molecule
Emp. Form.:
C19H20ClNO2
Mol. Mass.:
329.821
SMILES:
CN1CCc2cc(Cl)c(O)cc2C(C1)c1cccc2CCOc12
: