Target
Histamine H1 receptor
Ligand
BDBM22890
Substrate
Ki
12.58±n/a nM
Comments
PDSP_481
Citation
 Moguilevsky, NVarsalona, FNoyer, MGillard, MGuillaume, JPGarcia, LSzpirer, CSzpirer, JBollen, A Stable expression of human H1-histamine-receptor cDNA in Chinese hamster ovary cells. Pharmacological characterisation of the protein, tissue distribution of messenger RNA and chromosomal localisation of the gene. Eur J Biochem 224:489-95 (1994)  
Target
Name:
Histamine H1 receptor
Synonyms:
HISTAMINE H1 HRH1_CAVPO
Type:
G Protein-Coupled Receptor (GPCR)
Mol. Mass.:
55641.53
Organism:
Cavia porcellus (domestic guinea pig)
Description:
Guinea pig cerebellum was used in binding assay.
Residue:
488
  
Inhibitor
Name:
BDBM22890
Synonyms:
2-(2-{4-[(4-chlorophenyl)(phenyl)methyl]piperazin-1-yl}ethoxy)acetic acid Cetirizine | Levocetirizine
Type:
Small organic molecule
Emp. Form.:
C21H25ClN2O3
Mol. Mass.:
388.888
SMILES:
OC(=O)COCCN1CCN(CC1)C(c1ccccc1)c1ccc(Cl)cc1
: