Target
5-hydroxytryptamine receptor 5B
Ligand
BDBM21393
Substrate
Ki
398.1±n/a nM
Comments
PDSP_205
Citation
 Boess, FGMartin, IL Molecular biology of 5-HT receptors. Neuropharmacology 33:275-317 (1994)  
Target
Name:
5-hydroxytryptamine receptor 5B
Synonyms:
5-HT5B 5HT5B_MOUSE Htr5b
Type:
Enzyme Catalytic Domain
Mol. Mass.:
41221.13
Organism:
MOUSE
Description:
5-HT5B 0 MOUSE::P31387
Residue:
370
  
Inhibitor
Name:
BDBM21393
Synonyms:
7-(dipropylamino)-5,6,7,8-tetrahydronaphthalen-1-ol 8-OH-DPAT 8-OH-DPAT,(-) CHEMBL1788118 CHEMBL56 US10562853, Compound 8-OH-DPAT cid_1220
Type:
radiolabeled ligand
Emp. Form.:
C16H25NO
Mol. Mass.:
247.3758
SMILES:
CCCN(CCC)C1CCc2cccc(O)c2C1
: