Target
5-hydroxytryptamine receptor 7
Ligand
BDBM10755
Substrate
Ki
5.01±n/a nM
Comments
PDSP_150
Citation
 Boess, FGMartin, IL Molecular biology of 5-HT receptors. Neuropharmacology 33:275-317 (1994)  
Target
Name:
5-hydroxytryptamine receptor 7
Synonyms:
5-HT-7 5-HT7 5-hydroxytryptamine receptor 7 (5HT7) 5HT7R_MOUSE Serotonin 7 (5-HT7) receptor
Type:
Enzyme
Mol. Mass.:
49932.71
Organism:
Mus musculus (Mouse)
Description:
P32304
Residue:
448
  
Inhibitor
Name:
BDBM10755
Synonyms:
14C-5-hydroxy tryptamine creatinine disulfate 5-HT 5-hydroxy tryptamine creatinine disulfate Serotonin | [3H]-5-HT
Type:
Small organic molecule
Emp. Form.:
C10H12N2O
Mol. Mass.:
176.2151
SMILES:
NCCc1c[nH]c2ccc(O)cc12
: