Target
Kynurenine/alpha-aminoadipate aminotransferase, mitochondrial
Ligand
BDBM273152
Substrate
Meas. Tech.
KAT-II inhibitory assay
pH
8±n/a
IC50
12.0±n/a nM
Comments
extracted
Citation
 Okuyama, MFukunaga, KUsui, KHayashi, NIijima, DHoriuchi, HItagaki, N Bicyclic or tricyclic heterocyclic compound US Patent  US10065972 Publication Date 9/4/2018 
Target
Name:
Kynurenine/alpha-aminoadipate aminotransferase, mitochondrial
Synonyms:
2-aminoadipate aminotransferase AADAT Alpha-aminoadipate aminotransferase KAT2 Kynurenine aminotransferase II Kynurenine--oxoglutarate aminotransferase II Kynurenine--oxoglutarate transaminase II
Type:
Enzyme
Mol. Mass.:
47353.09
Organism:
Homo sapiens (Human)
Description:
Q8N5Z0
Residue:
425
  
Inhibitor
Name:
BDBM273152
Synonyms:
(R)-N-benzyl-1-[5-(3-methyl-[1,2,4]oxadiazol-5-yl)-7-oxo-6,7-dihydro[1,3]thiazolo[5,4-d]pyrimidin-2-yl]pyrrolidine-2-carboxamide | US10065972, Example 585
Type:
Small organic molecule
Emp. Form.:
C20H19N7O3S
Mol. Mass.:
437.475
SMILES:
Cc1noc(n1)-c1nc2sc(nc2c(=O)[nH]1)N1CCC[C@@H]1C(=O)NCc1ccccc1
: