Target
5-hydroxytryptamine receptor 3A
Ligand
BDBM10755
Substrate
Ki
>10000±n/a nM
Comments
PDSP_150
Citation
 Bonhaus, DWLoury, DNJakeman, LBTo, ZDeSouza, AEglen, RMWong, EH [3H]BIMU-1, a 5-hydroxytryptamine3 receptor ligand in NG-108 cells, selectively labels sigma-2 binding sites in guinea pig hippocampus. J Pharmacol Exp Ther 267:961-70 (1993) Target
Name:
5-hydroxytryptamine receptor 3A
Synonyms:
5-HT3 5HT3A_CAVPO HTR3 Serotonin 3a (5-HT3a) receptor
Type:
Enzyme Catalytic Domain
Mol. Mass.:
55657.07
Organism:
GUINEA PIG
Description:
5-HT3 HTR3A GUINEA PIG::O70212
Residue:
490
  
Inhibitor
Name:
BDBM10755
Synonyms:
14C-5-hydroxy tryptamine creatinine disulfate 5-HT 5-hydroxy tryptamine creatinine disulfate Serotonin | [3H]-5-HT
Type:
Small organic molecule
Emp. Form.:
C10H12N2O
Mol. Mass.:
176.2151
SMILES:
NCCc1c[nH]c2ccc(O)cc12
: