Target
Glutamate receptor ionotropic, kainate 4
Ligand
BDBM50002369
Substrate
Ki
2.29±n/a nM
Comments
PDSP_1011
Citation
 Kamboj, RKSchoepp, DDNutt, SShekter, LKorczak, BTrue, RARampersad, VZimmerman, DMWosnick, MA Molecular cloning, expression, and pharmacological characterization of humEAA1, a human kainate receptor subunit. J Neurochem 62:1-9 (1994)  
Target
Name:
Glutamate receptor ionotropic, kainate 4
Synonyms:
GRIK GRIK4 protein Glutamate-Kainate EAA1
Type:
Enzyme Catalytic Domain
Mol. Mass.:
107246.86
Organism:
Homo sapiens (Human)
Description:
Q16099
Residue:
956
  
Inhibitor
Name:
BDBM50002369
Synonyms:
(2S-(2alpha,3beta,4beta))-2-carboxy-4-(1-methylethenyl)-3-pyrrolidineacetic acid CHEMBL275040 Digensaeure Kainate L-alpha-kainic acid digenic acid | kainic acid
Type:
Small organic molecule
Emp. Form.:
C10H15NO4
Mol. Mass.:
213.2304
SMILES:
CC(=C)[C@H]1CN[C@@H]([C@H]1CC(O)=O)C(O)=O
: