Target
5-hydroxytryptamine receptor 2C
Ligand
BDBM50026917
Substrate
Ki
234.42±n/a nM
Comments
PDSP_405
Citation
 Millan, MJCanton, HGobert, ALejeune, FRivet, JMBervoets, KBrocco, MWiddowson, PMennini, TAudinot, V Novel benzodioxopiperazines acting as antagonists at postsynaptic 5-HT1A receptors and as agonists at 5-HT1A autoreceptors: a comparative pharmacological characterization with proposed 5-HT1A antagonists. J Pharmacol Exp Ther 268:337-52 (1994) Target
Name:
5-hydroxytryptamine receptor 2C
Synonyms:
5-HT2C | HTR2C
Type:
Enzyme Catalytic Domain
Mol. Mass.:
51519.58
Organism:
PIG
Description:
G7ZKZ7
Residue:
457
  
Inhibitor
Name:
BDBM50026917
Synonyms:
8-(2-(4-(2-methoxyphenyl)piperazin-1-yl)ethyl)-8-azaspiro[4.5]decane-7,9-dione 8-{2-[4-(2-Methoxy-phenyl)-piperazin-1-yl]-ethyl}-8-aza-spiro[4.5]decane-7,9-dione BMY 7378 CHEMBL1256934 CHEMBL543741
Type:
Small organic molecule
Emp. Form.:
C22H31N3O3
Mol. Mass.:
385.4998
SMILES:
COc1ccccc1N1CCN(CCN2C(=O)CC3(CCCC3)CC2=O)CC1
: