Target
Glucose-6-phosphate dehydrogenase-6-phosphogluconolactonase
Ligand
BDBM80999
Substrate
Meas. Tech.
Dose Response orthogonal assay utilizing the direct end-point detection of NADPH for uHTS small molecule inhibitors of Plasmodium falciparum Glucose-6-phosphate dehydrogenase
IC50
55800±n/a nM
Citation
 PubChem, PC Dose Response orthogonal assay utilizing the direct end-point detection of NADPH for uHTS small molecule inhibitors of Plasmodium falciparum Glucose-6-phosphate dehydrogenase PubChem Bioassay (2011)[AID] 
Target
Name:
Glucose-6-phosphate dehydrogenase-6-phosphogluconolactonase
Synonyms:
Type:
Enzyme Catalytic Domain
Mol. Mass.:
109731.64
Organism:
Plasmodium falciparum 3D7
Description:
gi_12381848
Residue:
950
  
Inhibitor
Name:
BDBM80999
Synonyms:
2-(phenylmethyl)-1,2-thiazol-3-one 2-Benzyl-isothiazol-3-one 2-benzyl-4-isothiazolin-3-one SMR000012107 | cid_647455
Type:
Small organic molecule
Emp. Form.:
C10H9NOS
Mol. Mass.:
191.25
SMILES:
O=c1ccsn1Cc1ccccc1
: