Target
Glucose-6-phosphate dehydrogenase-6-phosphogluconolactonase
Ligand
BDBM81000
Substrate
Meas. Tech.
Dose Response orthogonal assay utilizing the direct end-point detection of NADPH for uHTS small molecule inhibitors of Plasmodium falciparum Glucose-6-phosphate dehydrogenase
IC50
>80000±n/a nM
Citation
 PubChem, PC Dose Response orthogonal assay utilizing the direct end-point detection of NADPH for uHTS small molecule inhibitors of Plasmodium falciparum Glucose-6-phosphate dehydrogenase PubChem Bioassay (2011)[AID] 
Target
Name:
Glucose-6-phosphate dehydrogenase-6-phosphogluconolactonase
Synonyms:
Type:
Enzyme Catalytic Domain
Mol. Mass.:
109731.64
Organism:
Plasmodium falciparum 3D7
Description:
gi_12381848
Residue:
950
  
Inhibitor
Name:
BDBM81000
Synonyms:
4-(4-keto-1H-quinazolin-2-yl)-N-o-phenetyl-butyramide N-(2-Ethoxy-phenyl)-4-(4-oxo-3,4-dihydro-quinazolin-2-yl)-butyramide N-(2-ethoxyphenyl)-4-(4-oxo-1H-quinazolin-2-yl)butanamide cid_649980
Type:
Small organic molecule
Emp. Form.:
C20H21N3O3
Mol. Mass.:
351.399
SMILES:
CCOc1ccccc1NC(=O)CCCc1nc2ccccc2c(=O)[nH]1
: