Target
Glucose-6-phosphate dehydrogenase-6-phosphogluconolactonase
Ligand
BDBM33162
Substrate
Meas. Tech.
Dose Response orthogonal assay utilizing the direct end-point detection of NADPH for uHTS small molecule inhibitors of Plasmodium falciparum Glucose-6-phosphate dehydrogenase
IC50
47500±n/a nM
Citation
 PubChem, PC Dose Response orthogonal assay utilizing the direct end-point detection of NADPH for uHTS small molecule inhibitors of Plasmodium falciparum Glucose-6-phosphate dehydrogenase PubChem Bioassay (2011)[AID] 
Target
Name:
Glucose-6-phosphate dehydrogenase-6-phosphogluconolactonase
Synonyms:
Type:
Enzyme Catalytic Domain
Mol. Mass.:
109731.64
Organism:
Plasmodium falciparum 3D7
Description:
gi_12381848
Residue:
950
  
Inhibitor
Name:
BDBM33162
Synonyms:
(4E)-2,3-dihydroxy-4-[[2-(2-morpholin-4-ylsulfonyl-4-nitrophenyl)hydrazinyl]methylidene]cyclohexa-2,5-dien-1-one (4E)-2,3-dihydroxy-4-[[[2-(4-morpholinylsulfonyl)-4-nitrophenyl]hydrazo]methylidene]-1-cyclohexa-2,5-dienone MLS000336720 cid_6014955
Type:
Small organic molecule
Emp. Form.:
C17H18N4O8S
Mol. Mass.:
438.412
SMILES:
Oc1c([O-])ccc(C[NH+]=Nc2ccc(cc2S(=O)(=O)N2CCOCC2)[N+]([O-])=O)c1O
: