Target
Glucose-6-phosphate dehydrogenase-6-phosphogluconolactonase
Ligand
BDBM81099
Substrate
Meas. Tech.
Dose Response orthogonal assay utilizing the direct end-point detection of NADPH for uHTS small molecule inhibitors of Plasmodium falciparum Glucose-6-phosphate dehydrogenase
IC50
19900±n/a nM
Citation
 PubChem, PC Dose Response orthogonal assay utilizing the direct end-point detection of NADPH for uHTS small molecule inhibitors of Plasmodium falciparum Glucose-6-phosphate dehydrogenase PubChem Bioassay (2011)[AID] 
Target
Name:
Glucose-6-phosphate dehydrogenase-6-phosphogluconolactonase
Synonyms:
Type:
Enzyme Catalytic Domain
Mol. Mass.:
109731.64
Organism:
Plasmodium falciparum 3D7
Description:
gi_12381848
Residue:
950
  
Inhibitor
Name:
BDBM81099
Synonyms:
2-[2-[(5-chloranyl-3-methyl-1-phenyl-pyrazol-4-yl)methylidene]hydrazinyl]-6-methyl-1H-pyrimidin-4-one 2-[2-[(5-chloro-3-methyl-1-phenylpyrazol-4-yl)methylidene]hydrazinyl]-6-methyl-1H-pyrimidin-4-one MLS000761268 cid_4574137
Type:
Small organic molecule
Emp. Form.:
C16H15ClN6O
Mol. Mass.:
342.783
SMILES:
Cc1nn(c(Cl)c1CN=Nc1nc(C)cc(=O)[nH]1)-c1ccccc1
: