Target
Glucose-6-phosphate dehydrogenase-6-phosphogluconolactonase
Ligand
BDBM36839
Substrate
Meas. Tech.
Dose Response orthogonal kinetic assay utilizing the direct detection of NADPH for uHTS small molecule inhibitors of Plasmodium falciparum Glucose-6-phosphate dehydrogenase
IC50
14900±n/a nM
Citation
 PubChem, PC Dose Response orthogonal kinetic assay utilizing the direct detection of NADPH for uHTS small molecule inhibitors of Plasmodium falciparum Glucose-6-phosphate dehydrogenase PubChem Bioassay (2011)[AID] 
Target
Name:
Glucose-6-phosphate dehydrogenase-6-phosphogluconolactonase
Synonyms:
Type:
Enzyme Catalytic Domain
Mol. Mass.:
109731.64
Organism:
Plasmodium falciparum 3D7
Description:
gi_12381848
Residue:
950
  
Inhibitor
Name:
BDBM36839
Synonyms:
3-Methyl-benzofuran-2-carboxylic acid (3-methyl-4-tetrazol-1-yl-phenyl)-amide 3-methyl-N-[3-methyl-4-(1-tetrazolyl)phenyl]-2-benzofurancarboxamide 3-methyl-N-[3-methyl-4-(tetrazol-1-yl)phenyl]coumarilamide SMR000003825 | cid_647922
Type:
Small organic molecule
Emp. Form.:
C18H15N5O2
Mol. Mass.:
333.344
SMILES:
Cc1c(oc2ccccc12)C(=O)Nc1ccc(c(C)c1)-n1cnnn1
: