Target
Glucose-6-phosphate dehydrogenase-6-phosphogluconolactonase
Ligand
BDBM50262140
Substrate
Meas. Tech.
Dose Response orthogonal kinetic assay utilizing the direct detection of NADPH for uHTS small molecule inhibitors of Plasmodium falciparum Glucose-6-phosphate dehydrogenase
IC50
25000±n/a nM
Citation
 PubChem, PC Dose Response orthogonal kinetic assay utilizing the direct detection of NADPH for uHTS small molecule inhibitors of Plasmodium falciparum Glucose-6-phosphate dehydrogenase PubChem Bioassay (2011)[AID] 
Target
Name:
Glucose-6-phosphate dehydrogenase-6-phosphogluconolactonase
Synonyms:
Type:
Enzyme Catalytic Domain
Mol. Mass.:
109731.64
Organism:
Plasmodium falciparum 3D7
Description:
gi_12381848
Residue:
950
  
Inhibitor
Name:
BDBM50262140
Synonyms:
(17beta)-estra-1,3,5(10)-triene-2,3,17-triol 2-OH-estradiol CHEMBL467987 cid_247304 | estra-1,3,5(10)-triene-2,3,17beta-triol
Type:
Small organic molecule
Emp. Form.:
C18H24O3
Mol. Mass.:
288.3814
SMILES:
C[C@]12CC[C@H]3[C@@H](CCc4cc(O)c(O)cc34)[C@@H]1CC[C@@H]2O
: