Target
Glucose-6-phosphate dehydrogenase-6-phosphogluconolactonase
Ligand
BDBM34791
Substrate
Meas. Tech.
Dose Response orthogonal kinetic assay utilizing the direct detection of NADPH for uHTS small molecule inhibitors of Plasmodium falciparum Glucose-6-phosphate dehydrogenase
IC50
14600±n/a nM
Citation
 PubChem, PC Dose Response orthogonal kinetic assay utilizing the direct detection of NADPH for uHTS small molecule inhibitors of Plasmodium falciparum Glucose-6-phosphate dehydrogenase PubChem Bioassay (2011)[AID] 
Target
Name:
Glucose-6-phosphate dehydrogenase-6-phosphogluconolactonase
Synonyms:
Type:
Enzyme Catalytic Domain
Mol. Mass.:
109731.64
Organism:
Plasmodium falciparum 3D7
Description:
gi_12381848
Residue:
950
  
Inhibitor
Name:
BDBM34791
Synonyms:
MLS000392355 SMR000261243 methyl-[3-phenyl-2-(p-tolyl)-1,2,4-thiadiazol-2-ium-5-yl]amine;bromide
Type:
Small organic molecule
Emp. Form.:
C16H16N3S
Mol. Mass.:
282.383
SMILES:
CNc1nc(-c2ccccc2)[n+](s1)-c1ccc(C)cc1
: