Target
Dual specificity protein phosphatase 3
Ligand
BDBM82579
Substrate
Meas. Tech.
SAR VHR1 Fluorescent Assay for In Vitro dose response studies Set 3
IC50
48700±n/a nM
Citation
 PubChem, PC SAR VHR1 Fluorescent Assay for In Vitro dose response studies Set 3 PubChem Bioassay (2011)[AID] 
Target
Name:
Dual specificity protein phosphatase 3
Synonyms:
DUS3_HUMAN Dual specificity protein phosphatase (VHR) Dual specificity protein phosphatase VHR Tyrosine-protein phosphatase non-receptor type 1 | VHR
Type:
Hydrolase
Mol. Mass.:
20480.58
Organism:
Homo sapiens (Human)
Description:
Residue:
185
  
Inhibitor
Name:
BDBM82579
Synonyms:
4-methoxy-N-(4-methoxy-7-methyl-1,3-benzothiazol-2-yl)benzamide cid_7192678
Type:
Small organic molecule
Emp. Form.:
C17H16N2O3S
Mol. Mass.:
328.386
SMILES:
COc1ccc(cc1)C(=O)Nc1nc2c(OC)ccc(C)c2s1
: