Target
Carboxy-terminal domain RNA polymerase II polypeptide A small phosphatase 1
Ligand
BDBM40004
Substrate
Meas. Tech.
Dose Response confirmation of uHTS hits for Scp-1 phosphatase using a colorimetric assay
IC50
4583±253 nM
Citation
 PubChem, PC Dose Response confirmation of uHTS hits for Scp-1 phosphatase using a colorimetric assay PubChem Bioassay (2011)[AID] 
Target
Name:
Carboxy-terminal domain RNA polymerase II polypeptide A small phosphatase 1
Synonyms:
CTDS1_HUMAN NIF3 SCP1 | carboxy-terminal domain RNA polymerase II polypeptide A small phosphatase 1 isoform 1
Type:
Enzyme Catalytic Domain
Mol. Mass.:
29199.89
Organism:
Homo sapiens (Human)
Description:
gi_10864009
Residue:
261
  
Inhibitor
Name:
BDBM40004
Synonyms:
(4-oxidanylidenepyrimido[2,1-b][1,3]benzothiazol-2-yl)methyl 2-(6,7-dihydro-5H-cyclopenta[f][1]benzofuran-3-yl)ethanoate 2-(6,7-dihydro-5H-cyclopenta[f]benzofuran-3-yl)acetic acid (4-ketopyrimido[2,1-b][1,3]benzothiazol-2-yl)methyl ester MLS000056010 cid_3000165
Type:
Small organic molecule
Emp. Form.:
C24H18N2O4S
Mol. Mass.:
430.476
SMILES:
O=C(Cc1coc2cc3CCCc3cc12)OCc1cc(=O)n2c(n1)sc1ccccc21
: