Target
Carboxy-terminal domain RNA polymerase II polypeptide A small phosphatase 1
Ligand
BDBM59995
Substrate
Meas. Tech.
Dose Response confirmation of uHTS hits for Scp-1 phosphatase using a colorimetric assay
IC50
1025±104 nM
Citation
 PubChem, PC Dose Response confirmation of uHTS hits for Scp-1 phosphatase using a colorimetric assay PubChem Bioassay (2011)[AID] 
Target
Name:
Carboxy-terminal domain RNA polymerase II polypeptide A small phosphatase 1
Synonyms:
CTDS1_HUMAN NIF3 SCP1 | carboxy-terminal domain RNA polymerase II polypeptide A small phosphatase 1 isoform 1
Type:
Enzyme Catalytic Domain
Mol. Mass.:
29199.89
Organism:
Homo sapiens (Human)
Description:
gi_10864009
Residue:
261
  
Inhibitor
Name:
BDBM59995
Synonyms:
2-chloranyl-5-[2,5-dimethyl-3-[(E)-[2,4,6-tris(oxidanylidene)-1-(phenylmethyl)-1,3-diazinan-5-ylidene]methyl]pyrrol-1-yl]benzoic acid 5-[3-[(E)-(1-benzyl-2,4,6-triketo-hexahydropyrimidin-5-ylidene)methyl]-2,5-dimethyl-pyrrol-1-yl]-2-chloro-benzoic acid 5-{3-[(1-benzyl-2,4,6-trioxotetrahydro-5(2H)-pyrimidinylidene)methyl]-2,5-dimethyl-1H-pyrrol-1-yl}-2-chlorobenzoic acid SMR000230935 | cid_1728957
Type:
Small organic molecule
Emp. Form.:
C25H20ClN3O5
Mol. Mass.:
477.896
SMILES:
Cc1cc(\C=C2/C(=O)NC(=O)N(Cc3ccccc3)C2=O)c(C)n1-c1ccc(Cl)c(c1)C(O)=O
: