Target
Apelin receptor
Ligand
BDBM80031
Substrate
Meas. Tech.
SAR analysis counterscreen of small molecule antagonists of the CCR6 receptor using an APJ receptor luminescent beta-arrestin assay
IC50
11000±n/a nM
Citation
 PubChem, PC SAR analysis counterscreen of small molecule antagonists of the CCR6 receptor using an APJ receptor luminescent beta-arrestin assay PubChem Bioassay (2011)[AID] 
Target
Name:
Apelin receptor
Synonyms:
AGTRL1 APJ_HUMAN Angiotensin receptor-like 1 Apelin receptor (APJ) G-protein coupled receptor HG11
Type:
Enzyme Catalytic Domain
Mol. Mass.:
42664.06
Organism:
Homo sapiens (Human)
Description:
P35414
Residue:
380
  
Inhibitor
Name:
BDBM80031
Synonyms:
MLS001002995 N-(4-morpholin-4-ylsulfonylphenyl)-2-quinolin-8-ylsulfanylacetamide N-[4-(4-morpholinylsulfonyl)phenyl]-2-(8-quinolinylthio)acetamide cid_4261263
Type:
Small organic molecule
Emp. Form.:
C21H21N3O4S2
Mol. Mass.:
443.539
SMILES:
O=C(CSc1cccc2cccnc12)Nc1ccc(cc1)S(=O)(=O)N1CCOCC1
: