Target
Delta-type opioid receptor
Ligand
BDBM83289
Substrate
Meas. Tech.
Counterscreen for agonists of heterodimerization of the mu 1 (OPRM1) and delta 1 (OPRD1) opioid receptors: Luminescence-based cell-based high throughput dose response assay
EC50
>92480±n/a nM
Citation
 PubChem, PC Counterscreen for agonists of heterodimerization of the mu 1 (OPRM1) and delta 1 (OPRD1) opioid receptors: Luminescence-based cell-based high throughput dose response assay to identify agonists of OPRD1 homodimerization PubChem Bioassay (2011)[AID] 
Target
Name:
Delta-type opioid receptor
Synonyms:
D-OR-1 Delta opioid receptor OPIATE Delta OPRD1 OPRK1 | opioid receptor, delta 1
Type:
G Protein-Coupled Receptor (GPCR)
Mol. Mass.:
40382.98
Organism:
Homo sapiens (Human)
Description:
Competition binding assays were carried out using membrane preparations from transfected HN9.10 cells that constitutively expressed the delta opioid receptor.
Residue:
372
  
Inhibitor
Name:
BDBM83289
Synonyms:
2-O-[3-cyano-3-(1,3-dihydrobenzimidazol-2-ylidene)-2-oxopropyl] 4-O-ethyl 3,5-dimethyl-1H-pyrrole-2,4-dicarboxylate 3,5-dimethyl-1H-pyrrole-2,4-dicarboxylic acid O2-[3-cyano-3-(1,3-dihydrobenzimidazol-2-ylidene)-2-oxopropyl] ester O4-ethyl ester O2-[3-cyano-3-(1,3-dihydrobenzimidazol-2-ylidene)-2-oxidanylidene-propyl] O4-ethyl 3,5-dimethyl-1H-pyrrole-2,4-dicarboxylate cid_5742486
Type:
Small organic molecule
Emp. Form.:
C21H20N4O5
Mol. Mass.:
408.4073
SMILES:
CCOC(=O)c1c(C)[nH]c(C(=O)OCC(=O)C(C#N)c2nc3ccccc3[nH]2)c1C
: