Target
Delta-type opioid receptor
Ligand
BDBM83318
Substrate
Meas. Tech.
Counterscreen for agonists of heterodimerization of the mu 1 (OPRM1) and delta 1 (OPRD1) opioid receptors: Luminescence-based cell-based high throughput dose response assay
EC50
>30811±n/a nM
Citation
 PubChem, PC Counterscreen for agonists of heterodimerization of the mu 1 (OPRM1) and delta 1 (OPRD1) opioid receptors: Luminescence-based cell-based high throughput dose response assay to identify agonists of OPRD1 homodimerization PubChem Bioassay (2011)[AID] 
Target
Name:
Delta-type opioid receptor
Synonyms:
D-OR-1 Delta opioid receptor OPIATE Delta OPRD1 OPRK1 | opioid receptor, delta 1
Type:
G Protein-Coupled Receptor (GPCR)
Mol. Mass.:
40382.98
Organism:
Homo sapiens (Human)
Description:
Competition binding assays were carried out using membrane preparations from transfected HN9.10 cells that constitutively expressed the delta opioid receptor.
Residue:
372
  
Inhibitor
Name:
BDBM83318
Synonyms:
3-(4-Fluoro-phenyl)-2-[4-methoxy-3-(pyridin-2-ylsulfanylmethyl)-phenyl]-2,3-dihydro-1H-quinazolin-4-one 3-(4-fluorophenyl)-2-[4-methoxy-3-[(2-pyridinylthio)methyl]phenyl]-1,2-dihydroquinazolin-4-one MLS000588927 cid_3763981
Type:
Small organic molecule
Emp. Form.:
C27H22FN3O2S
Mol. Mass.:
471.546
SMILES:
COc1ccc(cc1CSc1ccccn1)C1Nc2ccccc2C(=O)N1c1ccc(F)cc1
: