Target
Delta-type opioid receptor
Ligand
BDBM58506
Substrate
Meas. Tech.
Counterscreen for agonists of heterodimerization of the mu 1 (OPRM1) and delta 1 (OPRD1) opioid receptors: Luminescence-based cell-based high throughput dose response assay
EC50
14159±n/a nM
Citation
 PubChem, PC Counterscreen for agonists of heterodimerization of the mu 1 (OPRM1) and delta 1 (OPRD1) opioid receptors: Luminescence-based cell-based high throughput dose response assay to identify agonists of OPRD1 homodimerization PubChem Bioassay (2011)[AID] 
Target
Name:
Delta-type opioid receptor
Synonyms:
D-OR-1 Delta opioid receptor OPIATE Delta OPRD1 OPRK1 | opioid receptor, delta 1
Type:
G Protein-Coupled Receptor (GPCR)
Mol. Mass.:
40382.98
Organism:
Homo sapiens (Human)
Description:
Competition binding assays were carried out using membrane preparations from transfected HN9.10 cells that constitutively expressed the delta opioid receptor.
Residue:
372
  
Inhibitor
Name:
BDBM58506
Synonyms:
5-(2,6-dichlorophenyl)-N-(4-ethylphenyl)-4-phenyl-1,3,4-thiadiazol-4-ium-2-amine;chloride MLS000948488 [5-(2,6-dichlorophenyl)-4-phenyl-1,3,4-thiadiazol-4-ium-2-yl]-(4-ethylphenyl)amine;chloride | cid_24789739
Type:
Small organic molecule
Emp. Form.:
C22H18Cl2N3S
Mol. Mass.:
427.369
SMILES:
CCc1ccc(Nc2n[n+](c(s2)-c2c(Cl)cccc2Cl)-c2ccccc2)cc1
: