Target
Endoribonuclease toxin MazF
Ligand
BDBM60553
Substrate
Meas. Tech.
Dose response confirmation uHTS hits for MazEF TA System activators via a fluorescence-based single-stranded RNase assay counterscreen
EC50
46900±n/a nM
Citation
 PubChem, PC Dose response confirmation uHTS hits for MazEF TA System activators via a fluorescence-based single-stranded RNase assay counterscreen PubChem Bioassay (2011)[AID] 
Target
Name:
Endoribonuclease toxin MazF
Synonyms:
MAZF_ECOLI chpAK mazF
Type:
Enzyme Catalytic Domain
Mol. Mass.:
12100.43
Organism:
Escherichia coli str. K-12 substr. MG1655
Description:
gi_16130689
Residue:
111
  
Inhibitor
Name:
BDBM60553
Synonyms:
MLS000390001 N-[(E)-(5-morpholino-2-thienyl)methyleneamino]carbamic acid tert-butyl ester SMR000259265 tert-butyl N-[(5-morpholin-4-ylthiophen-2-yl)methylideneamino]carbamate
Type:
Small organic molecule
Emp. Form.:
C14H21N3O3S
Mol. Mass.:
311.4
SMILES:
CC(C)(C)OC(=O)NN=Cc1ccc(s1)N1CCOCC1
: