Target
Endoribonuclease toxin MazF
Ligand
BDBM83586
Substrate
Meas. Tech.
Dose response confirmation uHTS hits for MazEF TA System activators via a fluorescence-based single-stranded RNase assay counterscreen
EC50
72000±n/a nM
Citation
 PubChem, PC Dose response confirmation uHTS hits for MazEF TA System activators via a fluorescence-based single-stranded RNase assay counterscreen PubChem Bioassay (2011)[AID] 
Target
Name:
Endoribonuclease toxin MazF
Synonyms:
MAZF_ECOLI chpAK mazF
Type:
Enzyme Catalytic Domain
Mol. Mass.:
12100.43
Organism:
Escherichia coli str. K-12 substr. MG1655
Description:
gi_16130689
Residue:
111
  
Inhibitor
Name:
BDBM83586
Synonyms:
(4Z)-2-(methylthio)-4-[(5-methyl-2-thiophenyl)methylidene]-5-thiazolone (4Z)-4-[(5-methyl-2-thienyl)methylene]-2-(methylthio)-2-thiazolin-5-one MLS000666337 cid_803385
Type:
Small organic molecule
Emp. Form.:
C10H9NOS3
Mol. Mass.:
255.38
SMILES:
CSC1=N\C(=C/c2ccc(C)s2)C(=O)S1
: